{"text_format":"1","workbook":"xlsx","n_sheets":7,"sheets":["Instructions","TIFA Identity","2014 Estimated TIF revenue","TIF small parcel exemption loss","Captured Millages","Tax Increment SmallTaxpayerLoss","Losses by millage"],"not_rendered":{"charts":0,"images":0,"macros":1,"external_links":1,"defined_names":4,"comments":2,"pivot_tables":0},"unopened":[],"bounds":{"document_bytes":16777216,"sheet_cells":100000,"rows_first":2000,"rows_last":500,"rows_between":2000,"halvings":0,"cell_chars":16384,"cell_head_chars":4096},"cells_cut":0,"cells_raw":0,"read":"whole","date_system":"1900"}

{"sheet":"Instructions","index":0,"n_rows":105,"n_cols":10,"rows_kept":105,"cut":false,"hidden":false,"merged":[[76,3,76,5],[76,6,76,7]]}
["BASIS OF REPORT - PUBLIC ACT 86 OF 2014, MCL 123.1341"]
[]
["This report is mandatory if you are seeking reimbursement of tax increment financing revenue losses stemming from exemptions"]
["claimed by taxpayers pursuant to the \"small taxpayer exemption loss.\""]
[]
["Section 5 (y) \"Small taxpayer exemption loss\" means the 2013 taxable value of commercial personal property and industrial "]
["personal property minus the 2014 taxable value of commercial personal property and industrial personal property."]
[]
["Sec. 16a (1) Not later than June 15, 2014 and June 15, 2015, each municipality that is a tax increment finance authority shall"]
["calculate and report to the department the municipality’s tax increment small taxpayer loss for the current calendar year."]
[]
["Sec 16b (2) If a municipality that is a tax increment finance authority fails to make the calculation and report it to the department by the date "]
["provided in section 16a, the department may extend the calculation and reporting date upon good cause as determined by the department."]
[]
["For 2014, the calculation and reporting date is extended for all authorities to August 29, 2014."]
[]
[]
["GENERAL GUIDELINES"]
[]
["You will need to provide information from multiple sources to complete this form. Reimbursement is based on the lower of 2012 millage"]
["rates and millage rates from the year immediately preceding the claim year. In 2014, that means the lower of 2012 and 2013. Treasury"]
["has compiled the lower of the two rates for every tax levy in the state, and you will have to enter them on the \"Captured Millages\" page."]
["Reimbursement is for losses related to \"commercial personal property\" and \"industrial personal property\" as those terms are defined in "]
["MCL 123.1345 (e) and (o), respectively."]
[]
["MCL 123.1357 (2)"]
["In fiscal year 2014-2015 and fiscal year 2015-2016, the (Local Community Stabilization) authority shall distribute to municipalities those "]
["funds appropriated under subsection (1)(a). However, in fiscal year 2014-2015, if the authority is not able to make the distribution under "]
["this subsection, the (Treasury) department shall make the distribution under this subsection on behalf of the authority."]
[]
{"$rows_left_out":76}
{"sheet":"TIFA Identity","index":1,"n_rows":40,"n_cols":10,"rows_kept":40,"cut":false,"hidden":false,"merged":[[13,7,13,9],[0,7,0,9],[36,9,39,9],[37,2,37,6],[11,7,11,9],[7,7,7,9],[15,7,15,9],[9,7,9,9],[17,7,17,9],[18,7,18,9],[39,4,39,7]]}
["Michigan Department of Treasury",null,null,null,null,null,null,"FOR CALENDAR YEAR 2014"]
["5176BR (6-14)"]
["Request for State Reimbursement of Tax Increment Finance Authority "]
["Tax Increment Small Taxpayer Loss for Brownfield Authorities (non-Brownfields Use Form 5176)"]
["Issued under Public Act 86 of 2014.  Filing is mandatory."]
["A SEPARATE REQUEST IS REQUIRED FOR EACH TAX INCREMENT FINANCING (TIF) DISTRICT and SCHOOL DISTRICT"]
[]
["Name of Municipality (County, City, Township, Village)"]
[]
["School District"]
[]
["Type of Authority ",null,null,null,null,null,null,"Brownfield Redevelopment Finance Authority"]
[]
["Authority Name/Identifier (optional)"]
[]
["E-mail address"]
[]
["Contact Person"]
["Telephone number"]
[]
["Did this TIF Plan also file the 2014 Form 4650"]
["Request for State Reimbursement of Tax Increment Revenue Decreases?"]
["(mark appropriate box with an 'X')"]
[null,null,null,null,null,null,null,"Yes",null,"No"]
[]
[]
[]
["Are any parcels in this Authority's TIF plan subject to a Renaissance Zone exemption?"]
["(mark appropriate box with an 'X')"]
[null,null,null,null,null,null,null,"Yes",null,"No"]
{"$rows_left_out":11}
{"sheet":"2014 Estimated TIF revenue","index":2,"n_rows":32,"n_cols":10,"rows_kept":32,"cut":false,"hidden":true,"merged":[]}
["Michigan Department of Treasury"]
["XXXX (6-14)"]
[]
["PROPERTY TYPE",null,"2014 TAXABLE VALUE",null,"INITIAL YEAR TAXABLE VALUE",null,"2014 CAPTURED TAXABLE VALUE",null,"MILLAGES CAPTURED","ESTIMATED 2014 TIF REVENUE"]
[null,null,null,null,null,null,null,null,"(use 2013 rates to estimate )"]
["Ad valorem PRE real property",null,0,null,0,null,{"$f":"C6-E6","v":0},null,36,{"$f":"G6*I6/1000","v":0}]
["Ad valorem non-PRE real property",null,45000,null,65000,null,{"$f":"C7-E7","v":-20000},null,54,{"$f":"G7*I7/1000","v":-1080}]
["Ad valorem non-PRE commercial personal property",null,23500,null,32870,null,-9370,null,42,-393.54]
["Ad valorem non-PRE industrial personal property",null,0,null,10000,null,-10000,null,30,-300]
["Ad valorem utility personal property",null,0,null,0,null,0,null,0,0]
["Ad valorem other personal property",null,0,null,0,null,{"$f":"C11-E11","v":0},null,0,0]
["IFT New Facility real property, 0% SET exemption",null,0,null,0,null,{"$f":"C12-E12","v":0},null,30,0]
["IFT New Facility real property, 50% SET exemption",null,0,null,0,null,0,null,27,0]
["IFT New Facility real property, 100% SET exemption",null,0,null,0,null,{"$f":"C14-E14","v":0},null,24,0]
["IFT New Facility personal property on commercial class land",null,800,null,10000,null,{"$f":"C15-E15","v":-9200},null,21,-193.2]
["IFT New Facility personal property on industrial class land",null,4200,null,11400,null,{"$f":"C16-E16","v":-7200},null,15,-108]
["IFT New Facility personal property, all other",null,0,null,0,null,{"$f":"C17-E17","v":0},null,0,0]
["IFT Replacement Facility real property (frozen values)",null,0,null,0,null,0,null,54,0]
["IFT Replacement Facility personal property (frozen values)",null,6000,null,6500,null,-500,null,54,-27]
["CFT New Facility real and personal property",null,0,null,0,null,{"$f":"C20-E20","v":0},null,0,0]
["CFT Restored (frozen values)",null,0,null,0,null,{"$f":"C21-E21","v":0},null,0,0]
[]
[null,null,null,null,null,null,null,null,"Total TIF Revenue",{"$f":"SUM(J6:J21)","v":-2101.7399999999998}]
[]
[]
[{"$f":"CONCATENATE(\"Municipality:   \",IF('TIFA Identity'!H8=\"\",\"\",'TIFA Identity'!H8))","v":"Municipality:   "}]
[]
[{"$f":"CONCATENATE(\"School District:   \",IF('TIFA Identity'!H10=\"\",\"\",'TIFA Identity'!H10))","v":"School District:   "}]
[]
[{"$f":"CONCATENATE(\"Authority Type:   \",IF('TIFA Identity'!H12=\"\",\"\",'TIFA Identity'!H12))","v":"Authority Type:   Brownfield Redevelopment Finance Authority"}]
{"$rows_left_out":3}
{"sheet":"TIF small parcel exemption loss","index":3,"n_rows":30,"n_cols":13,"rows_kept":30,"cut":false,"hidden":false,"merged":[[16,12,16,13],[19,12,19,13],[5,6,6,12],[0,12,0,13],[1,12,3,13],[8,12,8,13],[10,12,10,13],[13,12,13,13],[1,14,3,14],[1,16,3,16],[4,16,5,16],[19,9,19,10],[8,6,8,7],[10,6,10,7],[13,6,13,7],[16,6,16,7],[19,6,19,7],[13,9,13,10],[16,9,16,10],[8,14,8,15],[10,14,10,15],[13,14,13,15],[16,14,16,15],[19,14,19,15],[0,0,0,2],[10,9,10,10],[8,9,8,10],[0,6,0,7],[0,9,0,10],[1,6,3,7],[1,9,3,10],[1,0,1,2]]}
[{"$f":"'TIFA Identity'!A1","v":"Michigan Department of Treasury"},null,null,null,null,null,"A.",null,null,"B.",null,null,"C. (A-B)"]
[{"$f":"'TIFA Identity'!A2","v":"5176BR (6-14)"},null,null,null,null,null,"2013 captured value of personal property in Brownfield plan",null,null,"2014 captured value of personal property in Brownfield plan",null,null,"Personal Property total captured value loss (gain)"]
[null,"CAPTURED TAXABLE"]
[null," VALUE FROM:"]
[]
[null,null,null,null,null,null,"Minimum of 0 in captured value fields. \"Negative capture\" in a brownfield plan is prohibited by statute--MCL 125.2657 (2)"]
[]
[]
["1.","Ad valorem commercial personal property",null,null,null,null,null,null,null,null,null,null,{"$f":"G9-J9","v":0}]
[]
["2.","Ad valorem industrial personal property",null,null,null,null,null,null,null,null,null,null,{"$f":"G11-J11","v":0}]
[]
["3.","IFT New Facility personal property sited"]
[null,"on land classified commercial real property",null,null,null,null,null,null,null,null,null,null,{"$f":"G14-J14","v":0}]
[]
["4.","IFT New Facility personal property sited"]
[null,"on land classified industrial real property",null,null,null,null,null,null,null,null,null,null,{"$f":"G17-J17","v":0}]
[]
["5.","IFT Replacement Facility "]
[null,"personal property",null,null,null,null,null,null,null,null,null,null,{"$f":"G20-J20","v":0}]
[]
[]
[]
[{"$f":"CONCATENATE(\"Municipality:   \",IF('TIFA Identity'!H8=\"\",\"\",'TIFA Identity'!H8))","v":"Municipality:   "}]
[]
[{"$f":"CONCATENATE(\"School District:   \",IF('TIFA Identity'!H10=\"\",\"\",'TIFA Identity'!H10))","v":"School District:   "}]
[]
[{"$f":"CONCATENATE(\"Authority Type:   \",'TIFA Identity'!H12)","v":"Authority Type:   Brownfield Redevelopment Finance Authority"}]
[]
[{"$f":"CONCATENATE(\"Authority Name:   \",IF('TIFA Identity'!H14=\"\",\"\",'TIFA Identity'!H14))","v":"Authority Name:   "}]
{"$rows_left_out":1}
{"sheet":"Captured Millages","index":4,"n_rows":127,"n_cols":9,"rows_kept":127,"cut":false,"hidden":false,"merged":[[2,2,3,8]]}
[{"$f":"'TIFA Identity'!A1","v":"Michigan Department of Treasury"}]
[{"$f":"'TIFA Identity'!A2","v":"5176BR (6-14)"}]
["Taxes Captured",null,"Enter 100% of all tax millage rates levied on the ad valorem roll. If you don't capture it (e.g., school taxes or debt millage), enter 0 in \"Percent Captured\". Do NOT enter ad valorem special assessments."]
["Lower of 2012 or 2013 Millage Levies"]
["you must click on this hyperlink to find your reimbursement millage rates",null,"100% of Ad Valorem Rate",null,"Fixed rate foregone (if any)",null,"Percent Captured",null,"Adjusted Rate Captured"]
[]
["County Alloc/Charter",null,0,null,0,null,0,null,{"$f":"(C7-E7)*G7","v":0}]
[]
["County extra voted - type in purpose",null,0,null,0,null,0,null,{"$f":"(C9-E9)*G9","v":0}]
[]
["County extra voted - type in purpose",null,0,null,0,null,0,null,{"$f":"(C11-E11)*G11","v":0}]
[]
["County extra voted - type in purpose",null,0,null,0,null,0,null,{"$f":"(C13-E13)*G13","v":0}]
[]
["County extra voted - type in purpose",null,0,null,0,null,0,null,{"$f":"(C15-E15)*G15","v":0}]
[]
["County extra voted - type in purpose",null,0,null,0,null,0,null,{"$f":"(C17-E17)*G17","v":0}]
[]
["County extra voted - type in purpose",null,0,null,0,null,0,null,{"$f":"(C19-E19)*G19","v":0}]
[]
["County extra voted - type in purpose",null,0,null,0,null,0,null,{"$f":"(C21-E21)*G21","v":0}]
[]
["County extra voted - type in purpose",null,0,null,0,null,0,null,{"$f":"(C23-E23)*G23","v":0}]
[]
["County extra voted - type in purpose",null,0,null,0,null,0,null,{"$f":"(C25-E25)*G25","v":0}]
[]
["County extra voted - type in purpose",null,0,null,0,null,0,null,{"$f":"(C27-E27)*G27","v":0}]
[]
["County extra voted - type in purpose",null,0,null,0,null,0,null,{"$f":"(C29-E29)*G29","v":0}]
[]
{"$rows_left_out":98}
{"sheet":"Tax Increment SmallTaxpayerLoss","index":5,"n_rows":30,"n_cols":13,"rows_kept":30,"cut":false,"hidden":false,"merged":[[4,7,4,8],[16,7,16,8],[19,7,19,8],[8,7,8,8],[10,7,10,8],[13,7,13,8]]}
[{"$f":"'TIFA Identity'!A1","v":"Michigan Department of Treasury"}]
[{"$f":"'TIFA Identity'!A2","v":"5176BR (6-14)"}]
["Tax Increment Small Taxpayer Loss"]
[]
[null,null,null,null,null,null,null,"Captured Value loss (gain) (from 'TIF small parcel exemption loss', Col. C)",null,null,"Captured Millage (from 'Captured Millages', adjusted for exemptions by class)",null,"personal property TIF revenue loss (gain)"]
[]
[]
[]
["1.","Ad valorem commercial personal property",null,null,null,null,null,{"$f":"'TIF small parcel exemption loss'!M9","v":0},null,"x",{"$f":"('Captured Millages'!I118-'Captured Millages'!I75+(('Captured Millages'!C75-12)*'Captured Millages'!G75))","v":0},"=",{"$f":"H9*K9/1000","v":0}]
[]
["2.","Ad valorem industrial personal property",null,null,null,null,null,{"$f":"'TIF small parcel exemption loss'!M11","v":0},null,"x",{"$f":"'Captured Millages'!I118-'Captured Millages'!I75-('Captured Millages'!I85)","v":0},"=",{"$f":"H11*K11/1000","v":0}]
[]
["3.","IFT New Facility personal property "]
[null,"sited on land classified commercial real property",null,null,null,null,null,{"$f":"'TIF small parcel exemption loss'!M14","v":0},null,"x",{"$f":"K9*0.5","v":0},"=",{"$f":"H14*K14/1000","v":0}]
[]
["4.","IFT New Facility personal property "]
[null,"sited on land classified industrial real property",null,null,null,null,null,{"$f":"'TIF small parcel exemption loss'!M17","v":0},null,"x",{"$f":"K11*0.5","v":0},"=",{"$f":"H17*K17/1000","v":0}]
[]
["5.","IFT Replacement Facility "]
[null,"personal property",null,null,null,null,null,{"$f":"'TIF small parcel exemption loss'!M20","v":0},null,"x",{"$f":"'Captured Millages'!I118","v":0},"=",{"$f":"H20*K20/1000","v":0}]
[]
[null,"TOTAL TAX INCREMENT SMALL TAXPAYER LOSS TO REIMBURSE",null,null,null,null,null,null,null,null,null,null,{"$f":"MAX(0,SUM(M9:M20))","v":0}]
[]
[{"$f":"CONCATENATE(\"Municipality:   \",IF('TIFA Identity'!H8=\"\",\"\",'TIFA Identity'!H8))","v":"Municipality:   "}]
[]
[{"$f":"CONCATENATE(\"School District:   \",IF('TIFA Identity'!H10=\"\",\"\",'TIFA Identity'!H10))","v":"School District:   "}]
[]
[{"$f":"CONCATENATE(\"Authority Type:   \",IF('TIFA Identity'!H12=\"\",\"\",'TIFA Identity'!H12))","v":"Authority Type:   Brownfield Redevelopment Finance Authority"}]
[]
[{"$f":"CONCATENATE(\"Authority Name:   \",IF('TIFA Identity'!H14=\"\",\"\",'TIFA Identity'!H14))","v":"Authority Name:   "}]
{"$rows_left_out":1}
{"sheet":"Losses by millage","index":6,"n_rows":127,"n_cols":26,"rows_kept":127,"cut":false,"hidden":true,"merged":[]}
["TIF Small Taxpayer Loss by Millage/Tax Roll",null,null,null,null,null,null,null,null,null,null,null,null,null,{"$f":"'TIFA Identity'!H1","v":"FOR CALENDAR YEAR 2014"},null,null,null,null,null,null,null,null,null,null,"ortadata"]
[]
[null,null,"Adjusted Rate Captured",null,"Ad Valorem Commercial PP",null,"Ad Valorem Industrial PP",null,"IFT New Facility Commercial PP",null,"IFT New Facility Industrial PP",null,"IFT Replacement Facility PP",null,"TOTAL"]
[]
[]
[]
[{"$f":"'Captured Millages'!A7","v":"County Alloc/Charter"},null,{"$f":"'Captured Millages'!I7","v":0},null,{"$f":"'TIF small parcel exemption loss'!$M$9*'Losses by millage'!C7/1000","v":0},null,{"$f":"'TIF small parcel exemption loss'!$M$11*'Losses by millage'!C7/1000","v":0},null,{"$f":"'TIF small parcel exemption loss'!$M$14*'Losses by millage'!C7/1000*0.5","v":0},null,{"$f":"'TIF small parcel exemption loss'!$M$17*'Losses by millage'!C7/1000*0.5","v":0},null,{"$f":"'TIF small parcel exemption loss'!$M$20*'Losses by millage'!C7/1000","v":0},null,{"$f":"MAX(0,SUM(E7:N7))","v":0}]
[]
[{"$f":"'Captured Millages'!A9","v":"County extra voted - type in purpose"},null,{"$f":"'Captured Millages'!I9","v":0},null,{"$f":"'TIF small parcel exemption loss'!$M$9*'Losses by millage'!C9/1000","v":0},null,{"$f":"'TIF small parcel exemption loss'!$M$11*'Losses by millage'!C9/1000","v":0},null,{"$f":"'TIF small parcel exemption loss'!$M$14*'Losses by millage'!C9/1000*0.5","v":0},null,{"$f":"'TIF small parcel exemption loss'!$M$17*'Losses by millage'!C9/1000*0.5","v":0},null,{"$f":"'TIF small parcel exemption loss'!$M$20*'Losses by millage'!C9/1000","v":0},null,{"$f":"MAX(0,SUM(E9:N9))","v":0}]
[]
[{"$f":"'Captured Millages'!A11","v":"County extra voted - type in purpose"},null,{"$f":"'Captured Millages'!I11","v":0},null,{"$f":"'TIF small parcel exemption loss'!$M$9*'Losses by millage'!C11/1000","v":0},null,{"$f":"'TIF small parcel exemption loss'!$M$11*'Losses by millage'!C11/1000","v":0},null,{"$f":"'TIF small parcel exemption loss'!$M$14*'Losses by millage'!C11/1000*0.5","v":0},null,{"$f":"'TIF small parcel exemption loss'!$M$17*'Losses by millage'!C11/1000*0.5","v":0},null,{"$f":"'TIF small parcel exemption loss'!$M$20*'Losses by millage'!C11/1000","v":0},null,{"$f":"MAX(0,SUM(E11:N11))","v":0}]
[]
[{"$f":"'Captured Millages'!A13","v":"County extra voted - type in purpose"},null,{"$f":"'Captured Millages'!I13","v":0},null,{"$f":"'TIF small parcel exemption loss'!$M$9*'Losses by millage'!C13/1000","v":0},null,{"$f":"'TIF small parcel exemption loss'!$M$11*'Losses by millage'!C13/1000","v":0},null,{"$f":"'TIF small parcel exemption loss'!$M$14*'Losses by millage'!C13/1000*0.5","v":0},null,{"$f":"'TIF small parcel exemption loss'!$M$17*'Losses by millage'!C13/1000*0.5","v":0},null,{"$f":"'TIF small parcel exemption loss'!$M$20*'Losses by millage'!C13/1000","v":0},null,{"$f":"MAX(0,SUM(E13:N13))","v":0}]
[]
[{"$f":"'Captured Millages'!A15","v":"County extra voted - type in purpose"},null,{"$f":"'Captured Millages'!I15","v":0},null,{"$f":"'TIF small parcel exemption loss'!$M$9*'Losses by millage'!C15/1000","v":0},null,{"$f":"'TIF small parcel exemption loss'!$M$11*'Losses by millage'!C15/1000","v":0},null,{"$f":"'TIF small parcel exemption loss'!$M$14*'Losses by millage'!C15/1000*0.5","v":0},null,{"$f":"'TIF small parcel exemption loss'!$M$17*'Losses by millage'!C15/1000*0.5","v":0},null,{"$f":"'TIF small parcel exemption loss'!$M$20*'Losses by millage'!C15/1000","v":0},null,{"$f":"MAX(0,SUM(E15:N15))","v":0}]
[]
[{"$f":"'Captured Millages'!A17","v":"County extra voted - type in purpose"},null,{"$f":"'Captured Millages'!I17","v":0},null,{"$f":"'TIF small parcel exemption loss'!$M$9*'Losses by millage'!C17/1000","v":0},null,{"$f":"'TIF small parcel exemption loss'!$M$11*'Losses by millage'!C17/1000","v":0},null,{"$f":"'TIF small parcel exemption loss'!$M$14*'Losses by millage'!C17/1000*0.5","v":0},null,{"$f":"'TIF small parcel exemption loss'!$M$17*'Losses by millage'!C17/1000*0.5","v":0},null,{"$f":"'TIF small parcel exemption loss'!$M$20*'Losses by millage'!C17/1000","v":0},null,{"$f":"MAX(0,SUM(E17:N17))","v":0}]
[]
[{"$f":"'Captured Millages'!A19","v":"County extra voted - type in purpose"},null,{"$f":"'Captured Millages'!I19","v":0},null,{"$f":"'TIF small parcel exemption loss'!$M$9*'Losses by millage'!C19/1000","v":0},null,{"$f":"'TIF small parcel exemption loss'!$M$11*'Losses by millage'!C19/1000","v":0},null,{"$f":"'TIF small parcel exemption loss'!$M$14*'Losses by millage'!C19/1000*0.5","v":0},null,{"$f":"'TIF small parcel exemption loss'!$M$17*'Losses by millage'!C19/1000*0.5","v":0},null,{"$f":"'TIF small parcel exemption loss'!$M$20*'Losses by millage'!C19/1000","v":0},null,{"$f":"MAX(0,SUM(E19:N19))","v":0}]
[]
[{"$f":"'Captured Millages'!A21","v":"County extra voted - type in purpose"},null,{"$f":"'Captured Millages'!I21","v":0},null,{"$f":"'TIF small parcel exemption loss'!$M$9*'Losses by millage'!C21/1000","v":0},null,{"$f":"'TIF small parcel exemption loss'!$M$11*'Losses by millage'!C21/1000","v":0},null,{"$f":"'TIF small parcel exemption loss'!$M$14*'Losses by millage'!C21/1000*0.5","v":0},null,{"$f":"'TIF small parcel exemption loss'!$M$17*'Losses by millage'!C21/1000*0.5","v":0},null,{"$f":"'TIF small parcel exemption loss'!$M$20*'Losses by millage'!C21/1000","v":0},null,{"$f":"MAX(0,SUM(E21:N21))","v":0}]
[]
[{"$f":"'Captured Millages'!A23","v":"County extra voted - type in purpose"},null,{"$f":"'Captured Millages'!I23","v":0},null,{"$f":"'TIF small parcel exemption loss'!$M$9*'Losses by millage'!C23/1000","v":0},null,{"$f":"'TIF small parcel exemption loss'!$M$11*'Losses by millage'!C23/1000","v":0},null,{"$f":"'TIF small parcel exemption loss'!$M$14*'Losses by millage'!C23/1000*0.5","v":0},null,{"$f":"'TIF small parcel exemption loss'!$M$17*'Losses by millage'!C23/1000*0.5","v":0},null,{"$f":"'TIF small parcel exemption loss'!$M$20*'Losses by millage'!C23/1000","v":0},null,{"$f":"MAX(0,SUM(E23:N23))","v":0}]
[]
[{"$f":"'Captured Millages'!A25","v":"County extra voted - type in purpose"},null,{"$f":"'Captured Millages'!I25","v":0},null,{"$f":"'TIF small parcel exemption loss'!$M$9*'Losses by millage'!C25/1000","v":0},null,{"$f":"'TIF small parcel exemption loss'!$M$11*'Losses by millage'!C25/1000","v":0},null,{"$f":"'TIF small parcel exemption loss'!$M$14*'Losses by millage'!C25/1000*0.5","v":0},null,{"$f":"'TIF small parcel exemption loss'!$M$17*'Losses by millage'!C25/1000*0.5","v":0},null,{"$f":"'TIF small parcel exemption loss'!$M$20*'Losses by millage'!C25/1000","v":0},null,{"$f":"MAX(0,SUM(E25:N25))","v":0}]
[]
[{"$f":"'Captured Millages'!A27","v":"County extra voted - type in purpose"},null,{"$f":"'Captured Millages'!I27","v":0},null,{"$f":"'TIF small parcel exemption loss'!$M$9*'Losses by millage'!C27/1000","v":0},null,{"$f":"'TIF small parcel exemption loss'!$M$11*'Losses by millage'!C27/1000","v":0},null,{"$f":"'TIF small parcel exemption loss'!$M$14*'Losses by millage'!C27/1000*0.5","v":0},null,{"$f":"'TIF small parcel exemption loss'!$M$17*'Losses by millage'!C27/1000*0.5","v":0},null,{"$f":"'TIF small parcel exemption loss'!$M$20*'Losses by millage'!C27/1000","v":0},null,{"$f":"MAX(0,SUM(E27:N27))","v":0}]
[]
[{"$f":"'Captured Millages'!A29","v":"County extra voted - type in purpose"},null,{"$f":"'Captured Millages'!I29","v":0},null,{"$f":"'TIF small parcel exemption loss'!$M$9*'Losses by millage'!C29/1000","v":0},null,{"$f":"'TIF small parcel exemption loss'!$M$11*'Losses by millage'!C29/1000","v":0},null,{"$f":"'TIF small parcel exemption loss'!$M$14*'Losses by millage'!C29/1000*0.5","v":0},null,{"$f":"'TIF small parcel exemption loss'!$M$17*'Losses by millage'!C29/1000*0.5","v":0},null,{"$f":"'TIF small parcel exemption loss'!$M$20*'Losses by millage'!C29/1000","v":0},null,{"$f":"MAX(0,SUM(E29:N29))","v":0}]
[]
{"$rows_left_out":97}